Reaction Details
TargetCarbonic anhydrase 2
LigandBDBM50380139
Substrate/Competitorn/a
Meas. Tech.ChEMBL_811723 (CHEMBL2014298)
Kd 250±n/a nM
Citation Capkauskaite, EZubriene, ABaranauskiene, LTamulaitiene, GManakova, EKairys, VGražulis, STumkevicius, SMatulis, D Design of [(2-pyrimidinylthio)acetyl]benzenesulfonamides as inhibitors of human carbonic anhydrases. Eur J Med Chem51:259-70 (2012) 
 
Carbonic anhydrase 2
Name:Carbonic anhydrase 2
Type:Enzyme
Mol. Mass.:29250.71
Organism:Homo sapiens (Human)
Description:P00918
Residue:260
BDBM50380139
NameBDBM50380139
Synonyms:CHEMBL2011157
TypeSmall organic molecule
Emp. Form.C14H12ClNO3S2
Mol. Mass.341.833
SMILESNS(=O)(=O)c1cc(ccc1Cl)C(=O)CSc1ccccc1