Reaction Details
TargetCarbonic anhydrase 7
LigandBDBM50380148
Substrate/Competitorn/a
Meas. Tech.ChEMBL_811726 (CHEMBL2014301)
Kd 83±n/a nM
Citation Capkauskaite, EZubriene, ABaranauskiene, LTamulaitiene, GManakova, EKairys, VGražulis, STumkevicius, SMatulis, D Design of [(2-pyrimidinylthio)acetyl]benzenesulfonamides as inhibitors of human carbonic anhydrases. Eur J Med Chem51:259-70 (2012) 
 
Carbonic anhydrase 7
Name:Carbonic anhydrase 7
Type:Enzyme
Mol. Mass.:29664.11
Organism:Homo sapiens (Human)
Description:Human cloned isozyme.
Residue:264
BDBM50380148
NameBDBM50380148
Synonyms:CHEMBL2011156 | carbonic anhydrase (CA) inhibitors, benzenesulphonamide ligand, 6
TypeSmall organic molecule
Emp. Form.C12H11N3O3S2
Mol. Mass.309.364
SMILESNS(=O)(=O)c1ccc(cc1)C(=O)CSc1ncccn1