Reaction Details
TargetCarbonic anhydrase 1
LigandBDBM50380156
Substrate/Competitorn/a
Meas. Tech.ChEMBL_811722 (CHEMBL2014297)
Kd 100±n/a nM
Citation Capkauskaite, EZubriene, ABaranauskiene, LTamulaitiene, GManakova, EKairys, VGražulis, STumkevicius, SMatulis, D Design of [(2-pyrimidinylthio)acetyl]benzenesulfonamides as inhibitors of human carbonic anhydrases. Eur J Med Chem51:259-70 (2012) 
 
Carbonic anhydrase 1
Name:Carbonic anhydrase 1
Type:Enzyme
Mol. Mass.:28873.37
Organism:Homo sapiens (Human)
Description:P00915
Residue:261
BDBM50380156
NameBDBM50380156
Synonyms:CHEMBL2010990
TypeSmall organic molecule
Emp. Form.C20H19N3O4S2
Mol. Mass.429.513
SMILESCc1nc(SCC(=O)c2ccc(cc2)S(N)(=O)=O)[nH]c(=O)c1Cc1ccccc1