Reaction Details
TargetCell division cycle 7-related protein kinase/Protein DBF4 homolog A
LigandBDBM50380229
Substrate/Competitorn/a
Meas. Tech.ChEMBL_813521 (CHEMBL2019529)
IC50 1±n/a nM
Citation Lindvall, MMcBride, CMcKenna, MGesner, TGYabannavar, AWong, KLin, SWalter, AShafer, CM 3D Pharmacophore Model-Assisted Discovery of Novel CDC7 Inhibitors. ACS Med Chem Lett2:720-723 (2011) 
 
Cell division cycle 7-related protein kinase/Protein DBF4 homolog A
Name:Cell division cycle 7-related protein kinase/Protein DBF4 homolog A
Type:Protein
Mol. Mass.:n/a
Description:n/a
Components:This complex has 2 components.
Component 1
Name:Protein DBF4 homolog A
Synonyms:ASK Chiffon homolog A DBF4-type zinc finger-containing protein 1 DBF4A_HUMAN ZDBF1
Type:Regulatory subunit
Mol. Mass.:76869.65
Organism:Homo sapiens (Human)
Description:n/a
Residue:674
Component 2
Name:Cell division cycle 7-related protein kinase
Synonyms:CDC7 CDC7L1 Cell division cycle 7-related protein kinase (CDC7) huCdc7
Type:Protein
Mol. Mass.:63908.16
Organism:Homo sapiens (Human)
Description:O00311
Residue:574
BDBM50380229
NameBDBM50380229
Synonyms:CHEMBL2016996
TypeSmall organic molecule
Emp. Form.C17H17N5OS
Mol. Mass.339.415
SMILESO=C1NCC2(CCCCC2)c2sc(cc12)-c1ncnc2nc[nH]c12