Reaction Details
TargetKetohexokinase
LigandBDBM50380244
Substrate/Competitorn/a
Meas. Tech.ChEMBL_813545 (CHEMBL2019654)
IC50 100±n/a nM
Citation Maryanoff, BEMcComsey, DFYabut, SCLuci, DKJordan, ADMasucci, JAJones, WJAbad, MCGibbs, ACPetrounia, I Inhibitors of Ketohexokinase: Discovery of Pyrimidinopyrimidines with Specific Substitution that Complements the ATP-Binding Site. ACS Med Chem Lett2:538-543 (2011) 
 
Ketohexokinase
Name:Ketohexokinase
Type:Enzyme Catalytic Domain
Mol. Mass.:32521.64
Organism:Homo sapiens (Human)
Description:n/a
Residue:298
BDBM50380244
NameBDBM50380244
Synonyms:CHEMBL2017212
TypeSmall organic molecule
Emp. Form.C21H26N8O
Mol. Mass.406.4841
SMILESCOc1ccccc1Nc1nc(nc2c(NCC3CC3)ncnc12)N1CCNCC1