Reaction Details
TargetKetohexokinase
LigandBDBM50380266
Substrate/Competitorn/a
Meas. Tech.ChEMBL_813545 (CHEMBL2019654)
IC50 400±n/a nM
Citation Maryanoff, BEMcComsey, DFYabut, SCLuci, DKJordan, ADMasucci, JAJones, WJAbad, MCGibbs, ACPetrounia, I Inhibitors of Ketohexokinase: Discovery of Pyrimidinopyrimidines with Specific Substitution that Complements the ATP-Binding Site. ACS Med Chem Lett2:538-543 (2011) 
 
Ketohexokinase
Name:Ketohexokinase
Type:Enzyme Catalytic Domain
Mol. Mass.:32521.64
Organism:Homo sapiens (Human)
Description:n/a
Residue:298
BDBM50380266
NameBDBM50380266
Synonyms:CHEMBL2017233
TypeSmall organic molecule
Emp. Form.C24H26N8
Mol. Mass.426.5168
SMILESCc1ccccc1Nc1nc(nc2c(NCc3ccccc3)ncnc12)N1CCNCC1