Reaction Details
TargetKetohexokinase
LigandBDBM50380268
Substrate/Competitorn/a
Meas. Tech.ChEMBL_813545 (CHEMBL2019654)
IC50 60±n/a nM
Citation Maryanoff, BEMcComsey, DFYabut, SCLuci, DKJordan, ADMasucci, JAJones, WJAbad, MCGibbs, ACPetrounia, I Inhibitors of Ketohexokinase: Discovery of Pyrimidinopyrimidines with Specific Substitution that Complements the ATP-Binding Site. ACS Med Chem Lett2:538-543 (2011) 
 
Ketohexokinase
Name:Ketohexokinase
Type:Enzyme Catalytic Domain
Mol. Mass.:32521.64
Organism:Homo sapiens (Human)
Description:n/a
Residue:298
BDBM50380268
NameBDBM50380268
Synonyms:CHEMBL2017235
TypeSmall organic molecule
Emp. Form.C21H23N9S
Mol. Mass.433.533
SMILESCc1ccccc1Nc1nc(nc2c(NCc3nccs3)ncnc12)N1CCNCC1