Reaction Details
TargetKetohexokinase
LigandBDBM50380270
Substrate/Competitorn/a
Meas. Tech.ChEMBL_813545 (CHEMBL2019654)
IC50 1500±n/a nM
Citation Maryanoff, BEMcComsey, DFYabut, SCLuci, DKJordan, ADMasucci, JAJones, WJAbad, MCGibbs, ACPetrounia, I Inhibitors of Ketohexokinase: Discovery of Pyrimidinopyrimidines with Specific Substitution that Complements the ATP-Binding Site. ACS Med Chem Lett2:538-543 (2011) 
 
Ketohexokinase
Name:Ketohexokinase
Type:Enzyme Catalytic Domain
Mol. Mass.:32521.64
Organism:Homo sapiens (Human)
Description:n/a
Residue:298
BDBM50380270
NameBDBM50380270
Synonyms:CHEMBL2017237
TypeSmall organic molecule
Emp. Form.C22H28N8
Mol. Mass.404.5113
SMILESCN1CCN(CC1)c1nc(Nc2ccccc2C)c2ncnc(NCC3CC3)c2n1