Reaction Details
TargetKetohexokinase
LigandBDBM50380283
Substrate/Competitorn/a
Meas. Tech.ChEMBL_813545 (CHEMBL2019654)
IC50 10±n/a nM
Citation Maryanoff, BEMcComsey, DFYabut, SCLuci, DKJordan, ADMasucci, JAJones, WJAbad, MCGibbs, ACPetrounia, I Inhibitors of Ketohexokinase: Discovery of Pyrimidinopyrimidines with Specific Substitution that Complements the ATP-Binding Site. ACS Med Chem Lett2:538-543 (2011) 
 
Ketohexokinase
Name:Ketohexokinase
Type:Enzyme Catalytic Domain
Mol. Mass.:32521.64
Organism:Homo sapiens (Human)
Description:n/a
Residue:298
BDBM50380283
NameBDBM50380283
Synonyms:CHEMBL2017251
TypeSmall organic molecule
Emp. Form.C23H30N8S
Mol. Mass.450.603
SMILESCSc1ccccc1Nc1nc(nc2c(NCC3CC3)ncnc12)N1CCC(CN)CC1