Reaction Details
TargetGlycogen synthase kinase-3 beta
LigandBDBM50380246
Substrate/Competitorn/a
Meas. Tech.ChEMBL_813563 (CHEMBL2019672)
IC50>40000±n/a nM
Citation Maryanoff, BEMcComsey, DFYabut, SCLuci, DKJordan, ADMasucci, JAJones, WJAbad, MCGibbs, ACPetrounia, I Inhibitors of Ketohexokinase: Discovery of Pyrimidinopyrimidines with Specific Substitution that Complements the ATP-Binding Site. ACS Med Chem Lett2:538-543 (2011) 
 
Glycogen synthase kinase-3 beta
Name:Glycogen synthase kinase-3 beta
Type:Enzyme
Mol. Mass.:46756.38
Organism:Homo sapiens (Human)
Description:P49841
Residue:420
BDBM50380246
NameBDBM50380246
Synonyms:CHEMBL2017214
TypeSmall organic molecule
Emp. Form.C21H26N8S
Mol. Mass.422.55
SMILESCSc1ccccc1Nc1nc(nc2c(NCC3CC3)ncnc12)N1CCNCC1