Reaction Details
TargetCytochrome P450 2B6
LigandBDBM50380507
Substrate/Competitorn/a
Meas. Tech.ChEMBL_813099 (CHEMBL2020718)
IC50 4400±n/a nM
Citation Foti, RSRock, DAHan, XFlowers, RAWienkers, LCWahlstrom, JL Ligand-based design of a potent and selective inhibitor of cytochrome P450 2C19. J Med Chem55:1205-14 (2012) 
 
Cytochrome P450 2B6
Name:Cytochrome P450 2B6
Type:Protein
Mol. Mass.:56289.75
Organism:Homo sapiens (Human)
Description:P20813
Residue:491
BDBM50380507
NameBDBM50380507
Synonyms:CHEMBL2018921
TypeSmall organic molecule
Emp. Form.C15H13IN2OS
Mol. Mass.396.246
SMILESCOc1ccc2nc(SCc3ccc(I)cc3)[nH]c2c1