Reaction Details
TargetCytochrome P450 3A4
LigandBDBM50380511
Substrate/Competitorn/a
Meas. Tech.ChEMBL_813105 (CHEMBL2020724)
IC50 3560±n/a nM
Citation Foti, RSRock, DAHan, XFlowers, RAWienkers, LCWahlstrom, JL Ligand-based design of a potent and selective inhibitor of cytochrome P450 2C19. J Med Chem55:1205-14 (2012) 
 
Cytochrome P450 3A4
Name:Cytochrome P450 3A4
Type:Enzyme
Mol. Mass.:57349.57
Organism:Homo sapiens (Human)
Description:n/a
Residue:503
BDBM50380511
NameBDBM50380511
Synonyms:CHEMBL2018926
TypeSmall organic molecule
Emp. Form.C22H20N2O2S
Mol. Mass.376.471
SMILESCOc1ccc2nc(SCc3ccc(OCc4ccccc4)cc3)[nH]c2c1