Reaction Details
TargetCholecystokinin receptor type A
LigandBDBM50380728
Substrate/Competitorn/a
Meas. Tech.ChEMBL_813376 (CHEMBL2019603)
IC50 20.3±n/a nM
Citation Cameron, KOBeretta, EEChen, YChu-Moyer, MFernando, DGao, HKohrt, JLavergne, SJardine, Pda SGuzman-Perez, AHoth, CPerry, DAHadcock, JRGautreau, DMakowski, MPerez, SPolivkova, JRogers, LScott, DOSwick, AGThiede, LTrebino, CETrilles, RVWilmowski, JZhang, Y Discovery of new piperidine amide triazolobenzodiazepinones as intestinal-selective CCK1 receptor agonists. Bioorg Med Chem Lett22:2943-7 (2012) 
 
Cholecystokinin receptor type A
Name:Cholecystokinin receptor type A
Type:G Protein-Coupled Receptor (GPCR)
Mol. Mass.:47859.34
Organism:Homo sapiens (Human)
Description:Stable expression of human CCK-1 receptors in HEK 293 cells.
Residue:428
BDBM50380728
NameBDBM50380728
Synonyms:CHEMBL2017835
TypeSmall organic molecule
Emp. Form.C40H39N7O2
Mol. Mass.649.7834
SMILESCc1cc(C)cc(C[C@H]2CCCCN2C(=O)CN2c3ccccc3-n3c(nnc3-c3ccccc3)[C@H](Cc3n[nH]c4ccccc34)C2=O)c1