Reaction Details
TargetTyrosine-protein kinase receptor TYRO3
LigandBDBM50380766
Substrate/Competitorn/a
Meas. Tech.ChEMBL_813619 (CHEMBL2019768)
IC50 20±n/a nM
Citation Forns, PEsteve, CTaboada, LAlonso, JAOrellana, AMaldonado, MCarreño, CRamis, ILópez, MMiralpeix, MVidal, B Pyrazine-based Syk kinase inhibitors. Bioorg Med Chem Lett22:2784-8 (2012) 
 
Tyrosine-protein kinase receptor TYRO3
Name:Tyrosine-protein kinase receptor TYRO3
Type:Protein
Mol. Mass.:96894.13
Organism:Homo sapiens (Human)
Description:Q06418
Residue:890
BDBM50380766
NameBDBM50380766
Synonyms:CHEMBL2018146
TypeSmall organic molecule
Emp. Form.C26H30N6O2
Mol. Mass.458.5554
SMILESCCn1cc(cn1)-c1cccc(c1)-c1cnc(N)c(n1)C(=O)N[C@H]1C2CC3CC1C[C@](O)(C3)C2