Reaction Details
TargetAcetylcholinesterase
LigandBDBM50029799
Substrate/Competitorn/a
Meas. Tech.ChEMBL_813752 (CHEMBL2020010)
IC50 4900±n/a nM
Citation Khorana, NChangwichit, KIngkaninan, KUtsintong, M Prospective acetylcholinesterase inhibitory activity of indole and its analogs. Bioorg Med Chem Lett22:2885-8 (2012) 
 
Acetylcholinesterase
Name:Acetylcholinesterase
Type:Enzyme
Mol. Mass.:71812.79
Organism:Electrophorus electricus (Electric eel)
Description:n/a
Residue:633
BDBM50029799
NameBDBM50029799
Synonyms:7-Methoxy-1-methyl-2,9-dihydro-1H-beta-carboline 7-methoxy-1-methyl-4,9-dihydro-3H-pyrido[3,4-b]indole CHEMBL340807 | HARMALINE
TypeSmall organic molecule
Emp. Form.C13H14N2O
Mol. Mass.214.2631
SMILESCOc1ccc2c3CCN=C(C)c3[nH]c2c1