Reaction Details
TargetCannabinoid receptor 1
LigandBDBM50380849
Substrate/Competitorn/a
Meas. Tech.ChEMBL_813922 (CHEMBL2020401)
Ki 39±n/a nM
Citation Odan, MIshizuka, NHiramatsu, YInagaki, MHashizume, HFujii, YMitsumori, SMorioka, YSoga, MDeguchi, MYasui, KArimura, A CB 1/2 dual agonists with 3-carbamoyl 2-pyridone derivatives as antipruritics: reduction of CNS side effects by introducing polar functional groups. Bioorg Med Chem Lett22:2894-7 (2012) 
 
Cannabinoid receptor 1
Name:Cannabinoid receptor 1
Type:G Protein-Coupled Receptor (GPCR)
Mol. Mass.:52868.96
Organism:Homo sapiens (Human)
Description:P21554
Residue:472
BDBM50380849
NameBDBM50380849
Synonyms:CHEMBL2018778
TypeSmall organic molecule
Emp. Form.C29H46N4O5S
Mol. Mass.562.764
SMILESCC(C)(NC(=O)c1cc2CCCCCCc2n(CC2CCCCC2)c1=O)C(=O)N1CCC(CC1)NS(C)(=O)=O