Reaction Details
TargetCannabinoid receptor 2
LigandBDBM50380853
Substrate/Competitorn/a
Meas. Tech.ChEMBL_813923 (CHEMBL2020402)
Ki 0.6±n/a nM
Citation Odan, MIshizuka, NHiramatsu, YInagaki, MHashizume, HFujii, YMitsumori, SMorioka, YSoga, MDeguchi, MYasui, KArimura, A CB 1/2 dual agonists with 3-carbamoyl 2-pyridone derivatives as antipruritics: reduction of CNS side effects by introducing polar functional groups. Bioorg Med Chem Lett22:2894-7 (2012) 
 
Cannabinoid receptor 2
Name:Cannabinoid receptor 2
Type:G Protein-Coupled Receptor (GPCR)
Mol. Mass.:39690.94
Organism:Homo sapiens (Human)
Description:P34972
Residue:360
BDBM50380853
NameBDBM50380853
Synonyms:CHEMBL2018657
TypeSmall organic molecule
Emp. Form.C26H41N3O4
Mol. Mass.459.6214
SMILESCN(CCO)C(=O)C(C)(C)NC(=O)c1cc2CCCCCCc2n(CC2CCCCC2)c1=O