Reaction Details
TargetC-C chemokine receptor type 4
LigandBDBM50380881
Substrate/Competitorn/a
Meas. Tech.ChEMBL_812672 (CHEMBL2019173)
Kd 50.12±n/a nM
Citation Procopiou, PAFord, AJGraves, RHHall, DAHodgson, STLacroix, YMNeedham, DSlack, RJ Lead optimisation of the N1 substituent of a novel series of indazole arylsulfonamides as CCR4 antagonists and identification of a candidate for clinical investigation. Bioorg Med Chem Lett22:2730-3 (2012) 
 
C-C chemokine receptor type 4
Name:C-C chemokine receptor type 4
Type:Enzyme
Mol. Mass.:41406.41
Organism:Homo sapiens (Human)
Description:P51679
Residue:360
BDBM50380881
NameBDBM50380881
Synonyms:CHEMBL2018953
TypeSmall organic molecule
Emp. Form.C24H27Cl2N7O
Mol. Mass.500.423
SMILESClc1ccc(CNc2nc(nc3ncccc23)N2CCN(CC2)C(=O)[C@H]2CCCCN2)c(Cl)c1