Reaction Details
TargetC-C chemokine receptor type 4
LigandBDBM50380870
Substrate/Competitorn/a
Meas. Tech.ChEMBL_812669 (CHEMBL2019170)
IC50 158.49±n/a nM
Citation Procopiou, PAFord, AJGraves, RHHall, DAHodgson, STLacroix, YMNeedham, DSlack, RJ Lead optimisation of the N1 substituent of a novel series of indazole arylsulfonamides as CCR4 antagonists and identification of a candidate for clinical investigation. Bioorg Med Chem Lett22:2730-3 (2012) 
 
C-C chemokine receptor type 4
Name:C-C chemokine receptor type 4
Type:Enzyme
Mol. Mass.:41406.41
Organism:Homo sapiens (Human)
Description:P51679
Residue:360
BDBM50380870
NameBDBM50380870
Synonyms:CHEMBL2018957
TypeSmall organic molecule
Emp. Form.C20H18ClN3O4S2
Mol. Mass.463.958
SMILESCOc1cccc(Cn2nc(NS(=O)(=O)c3ccc(Cl)s3)c3c(OC)cccc23)c1