Reaction Details
TargetCannabinoid receptor 1
LigandBDBM50380890
Substrate/Competitorn/a
Meas. Tech.ChEMBL_812807 (CHEMBL2020074)
Ki 3952±n/a nM
Citation Odan, MIshizuka, NHiramatsu, YInagaki, MHashizume, HFujii, YMitsumori, SMorioka, YSoga, MDeguchi, MYasui, KArimura, A Discovery of S-777469: an orally available CB2 agonist as an antipruritic agent. Bioorg Med Chem Lett22:2803-6 (2012) 
 
Cannabinoid receptor 1
Name:Cannabinoid receptor 1
Type:G Protein-Coupled Receptor (GPCR)
Mol. Mass.:52868.96
Organism:Homo sapiens (Human)
Description:P21554
Residue:472
BDBM50380890
NameBDBM50380890
Synonyms:CHEMBL2019087
TypeSmall organic molecule
Emp. Form.C27H31N3O4
Mol. Mass.461.5527
SMILESOC(=O)C1(CCCCC1)NC(=O)c1cc2CCCCCCc2n(Cc2ccc(cc2)C#N)c1=O