Reaction Details
TargetCannabinoid receptor 1
LigandBDBM50380893
Substrate/Competitorn/a
Meas. Tech.ChEMBL_812807 (CHEMBL2020074)
Ki>5000±n/a nM
Citation Odan, MIshizuka, NHiramatsu, YInagaki, MHashizume, HFujii, YMitsumori, SMorioka, YSoga, MDeguchi, MYasui, KArimura, A Discovery of S-777469: an orally available CB2 agonist as an antipruritic agent. Bioorg Med Chem Lett22:2803-6 (2012) 
 
Cannabinoid receptor 1
Name:Cannabinoid receptor 1
Type:G Protein-Coupled Receptor (GPCR)
Mol. Mass.:52868.96
Organism:Homo sapiens (Human)
Description:P21554
Residue:472
BDBM50380893
NameBDBM50380893
Synonyms:CHEMBL2019091
TypeSmall organic molecule
Emp. Form.C25H31FN2O4
Mol. Mass.442.523
SMILESCCCc1c(CC)cc(C(=O)NC2(CCCCC2)C(O)=O)c(=O)n1Cc1ccc(F)cc1