Reaction Details
TargetCannabinoid receptor 2
LigandBDBM50380899
Substrate/Competitorn/a
Meas. Tech.ChEMBL_812808 (CHEMBL2020075)
Ki 348±n/a nM
Citation Odan, MIshizuka, NHiramatsu, YInagaki, MHashizume, HFujii, YMitsumori, SMorioka, YSoga, MDeguchi, MYasui, KArimura, A Discovery of S-777469: an orally available CB2 agonist as an antipruritic agent. Bioorg Med Chem Lett22:2803-6 (2012) 
 
Cannabinoid receptor 2
Name:Cannabinoid receptor 2
Type:G Protein-Coupled Receptor (GPCR)
Mol. Mass.:39690.94
Organism:Homo sapiens (Human)
Description:P34972
Residue:360
BDBM50380899
NameBDBM50380899
Synonyms:CHEMBL2019088
TypeSmall organic molecule
Emp. Form.C20H30N2O4
Mol. Mass.362.4632
SMILESCCCCn1c(CC)c(C)cc(C(=O)NC2(CCCCC2)C(O)=O)c1=O