Reaction Details
TargetCannabinoid receptor 2
LigandBDBM50380893
Substrate/Competitorn/a
Meas. Tech.ChEMBL_812808 (CHEMBL2020075)
Ki 263±n/a nM
Citation Odan, MIshizuka, NHiramatsu, YInagaki, MHashizume, HFujii, YMitsumori, SMorioka, YSoga, MDeguchi, MYasui, KArimura, A Discovery of S-777469: an orally available CB2 agonist as an antipruritic agent. Bioorg Med Chem Lett22:2803-6 (2012) 
 
Cannabinoid receptor 2
Name:Cannabinoid receptor 2
Type:G Protein-Coupled Receptor (GPCR)
Mol. Mass.:39690.94
Organism:Homo sapiens (Human)
Description:P34972
Residue:360
BDBM50380893
NameBDBM50380893
Synonyms:CHEMBL2019091
TypeSmall organic molecule
Emp. Form.C25H31FN2O4
Mol. Mass.442.523
SMILESCCCc1c(CC)cc(C(=O)NC2(CCCCC2)C(O)=O)c(=O)n1Cc1ccc(F)cc1