Reaction Details
TargetCannabinoid receptor 1
LigandBDBM50380887
Substrate/Competitorn/a
Meas. Tech.ChEMBL_812809 (CHEMBL2020076)
IC50>2000±n/a nM
Citation Odan, MIshizuka, NHiramatsu, YInagaki, MHashizume, HFujii, YMitsumori, SMorioka, YSoga, MDeguchi, MYasui, KArimura, A Discovery of S-777469: an orally available CB2 agonist as an antipruritic agent. Bioorg Med Chem Lett22:2803-6 (2012) 
 
Cannabinoid receptor 1
Name:Cannabinoid receptor 1
Type:G Protein-Coupled Receptor (GPCR)
Mol. Mass.:52868.96
Organism:Homo sapiens (Human)
Description:P21554
Residue:472
BDBM50380887
NameBDBM50380887
Synonyms:CHEMBL2019083
TypeSmall organic molecule
Emp. Form.C23H34N2O4
Mol. Mass.402.5271
SMILESCCCCn1c2CCCCCCc2cc(C(=O)NC2(CCCCC2)C(O)=O)c1=O