Reaction Details
TargetCannabinoid receptor 1
LigandBDBM50380889
Substrate/Competitorn/a
Meas. Tech.ChEMBL_812809 (CHEMBL2020076)
IC50 514±n/a nM
Citation Odan, MIshizuka, NHiramatsu, YInagaki, MHashizume, HFujii, YMitsumori, SMorioka, YSoga, MDeguchi, MYasui, KArimura, A Discovery of S-777469: an orally available CB2 agonist as an antipruritic agent. Bioorg Med Chem Lett22:2803-6 (2012) 
 
Cannabinoid receptor 1
Name:Cannabinoid receptor 1
Type:G Protein-Coupled Receptor (GPCR)
Mol. Mass.:52868.96
Organism:Homo sapiens (Human)
Description:P21554
Residue:472
BDBM50380889
NameBDBM50380889
Synonyms:CHEMBL2019086
TypeSmall organic molecule
Emp. Form.C26H31FN2O4
Mol. Mass.454.5337
SMILESOC(=O)C1(CCCCC1)NC(=O)c1cc2CCCCCCc2n(Cc2ccc(F)cc2)c1=O