Reaction Details
TargetCannabinoid receptor 2
LigandBDBM50380886
Substrate/Competitorn/a
Meas. Tech.ChEMBL_812810 (CHEMBL2020077)
IC50 51±n/a nM
Citation Odan, MIshizuka, NHiramatsu, YInagaki, MHashizume, HFujii, YMitsumori, SMorioka, YSoga, MDeguchi, MYasui, KArimura, A Discovery of S-777469: an orally available CB2 agonist as an antipruritic agent. Bioorg Med Chem Lett22:2803-6 (2012) 
 
Cannabinoid receptor 2
Name:Cannabinoid receptor 2
Type:G Protein-Coupled Receptor (GPCR)
Mol. Mass.:39690.94
Organism:Homo sapiens (Human)
Description:P34972
Residue:360
BDBM50380886
NameBDBM50380886
Synonyms:CHEMBL2019082
TypeSmall organic molecule
Emp. Form.C27H40N2O4
Mol. Mass.456.6175
SMILESOC(=O)[C@@H](NC(=O)c1cc2CCCCCCc2n(CC2CCCCC2)c1=O)C1CCCCC1