Reaction Details
TargetDelta-type opioid receptor
LigandBDBM50380910
Substrate/Competitorn/a
Meas. Tech.ChEMBL_813972 (CHEMBL2020484)
Ki 2.49±n/a nM
Citation Watanabe, YKitazawa, SFujii, HNemoto, THirayama, SNagase, H Design and synthesis of novel opioid ligands with an azabicyclo[2.2.2]octane skeleton and their pharmacologies. Bioorg Med Chem Lett22:2689-92 (2012) 
 
Delta-type opioid receptor
Name:Delta-type opioid receptor
Type:Enzyme Catalytic Domain
Mol. Mass.:40577.25
Organism:MOUSE
Description:P32300
Residue:372
BDBM50380910
NameBDBM50380910
Synonyms:CHEMBL2016679
TypeSmall organic molecule
Emp. Form.C21H26N2O3
Mol. Mass.354.4427
SMILESCN[C@]12CCC(=O)[C@@H]3Oc4c5c(C[C@H]1N(CC1CC1)CC[C@@]235)ccc4O