Reaction Details
TargetMu-type opioid receptor
LigandBDBM50380904
Substrate/Competitorn/a
Meas. Tech.ChEMBL_813970 (CHEMBL2020482)
Ki 0.41±n/a nM
Citation Watanabe, YKitazawa, SFujii, HNemoto, THirayama, SNagase, H Design and synthesis of novel opioid ligands with an azabicyclo[2.2.2]octane skeleton and their pharmacologies. Bioorg Med Chem Lett22:2689-92 (2012) 
 
Mu-type opioid receptor
Name:Mu-type opioid receptor
Type:Enzyme Catalytic Domain
Mol. Mass.:44431.62
Organism:MOUSE
Description:OPIATE Mu OPRM1 MOUSE::P42866
Residue:398
BDBM50380904
NameBDBM50380904
Synonyms:CHEMBL2016672
TypeSmall organic molecule
Emp. Form.C21H25NO4
Mol. Mass.355.4275
SMILESOc1ccc2C[C@H]3N(CC4CC4)CC[C@@]45[C@@H](Oc1c24)[C@@]1(O)CC[C@@]35OC1