Reaction Details
TargetNeuropeptide Y receptor type 5
LigandBDBM50380924
Substrate/Competitorn/a
Meas. Tech.ChEMBL_813976 (CHEMBL2020488)
Ki 82±n/a nM
Citation Fichtner, MLee, ETomlinson, EScott, DCornelius, PPatterson, TACarpino, PA Discovery and evaluation of spirocyclic derivatives as antagonists of the neuropeptide Y5 receptor. Bioorg Med Chem Lett22:2738-43 (2012) 
 
Neuropeptide Y receptor type 5
Name:Neuropeptide Y receptor type 5
Type:Enzyme
Mol. Mass.:50746.64
Organism:Homo sapiens (Human)
Description:Q15761
Residue:445
BDBM50380924
NameBDBM50380924
Synonyms:CHEMBL2016741
TypeSmall organic molecule
Emp. Form.C25H25N5O3
Mol. Mass.443.4977
SMILESCN([C@H]1CC[C@@]2(CC1)Cc1cnccc1C(=O)O2)C(=O)Nc1cnc(cn1)-c1ccccc1