Reaction Details
TargetTyrosine-protein kinase ITK/TSK
LigandBDBM50381092
Substrate/Competitorn/a
Meas. Tech.ChEMBL_814173 (CHEMBL2020887)
IC50 1.9±n/a nM
Citation McLean, LRZhang, YZaidi, NBi, XWang, RDharanipragada, RJurcak, JGGillespy, TAZhao, ZMusick, KYChoi, YMBarrague, MPeppard, JSmicker, MDuguid, MParkar, AFordham, JKominos, D X-ray crystallographic structure-based design of selective thienopyrazole inhibitors for interleukin-2-inducible tyrosine kinase. Bioorg Med Chem Lett22:3296-300 (2012) 
 
Tyrosine-protein kinase ITK/TSK
Name:Tyrosine-protein kinase ITK/TSK
Type:Protein
Mol. Mass.:71839.20
Organism:Homo sapiens (Human)
Description:Q08881
Residue:620
BDBM50381092
NameBDBM50381092
Synonyms:CHEMBL2017552
TypeSmall organic molecule
Emp. Form.C16H15N3OS
Mol. Mass.297.375
SMILESCC(C)(O)c1ccc2cc([nH]c2c1)-c1n[nH]c2ccsc12