Reaction Details
TargetTyrosine-protein kinase TXK
LigandBDBM50381092
Substrate/Competitorn/a
Meas. Tech.ChEMBL_814176 (CHEMBL2020890)
IC50 73.8±n/a nM
Citation McLean, LRZhang, YZaidi, NBi, XWang, RDharanipragada, RJurcak, JGGillespy, TAZhao, ZMusick, KYChoi, YMBarrague, MPeppard, JSmicker, MDuguid, MParkar, AFordham, JKominos, D X-ray crystallographic structure-based design of selective thienopyrazole inhibitors for interleukin-2-inducible tyrosine kinase. Bioorg Med Chem Lett22:3296-300 (2012) 
 
Tyrosine-protein kinase TXK
Name:Tyrosine-protein kinase TXK
Type:Protein
Mol. Mass.:61268.80
Organism:Homo sapiens (Human)
Description:P42681
Residue:527
BDBM50381092
NameBDBM50381092
Synonyms:CHEMBL2017552
TypeSmall organic molecule
Emp. Form.C16H15N3OS
Mol. Mass.297.375
SMILESCC(C)(O)c1ccc2cc([nH]c2c1)-c1n[nH]c2ccsc12