Reaction Details
TargetTyrosine-protein kinase TXK
LigandBDBM50381093
Substrate/Competitorn/a
Meas. Tech.ChEMBL_814176 (CHEMBL2020890)
IC50 55.7±n/a nM
Citation McLean, LRZhang, YZaidi, NBi, XWang, RDharanipragada, RJurcak, JGGillespy, TAZhao, ZMusick, KYChoi, YMBarrague, MPeppard, JSmicker, MDuguid, MParkar, AFordham, JKominos, D X-ray crystallographic structure-based design of selective thienopyrazole inhibitors for interleukin-2-inducible tyrosine kinase. Bioorg Med Chem Lett22:3296-300 (2012) 
 
Tyrosine-protein kinase TXK
Name:Tyrosine-protein kinase TXK
Type:Protein
Mol. Mass.:61268.80
Organism:Homo sapiens (Human)
Description:P42681
Residue:527
BDBM50381093
NameBDBM50381093
Synonyms:CHEMBL2017554
TypeSmall organic molecule
Emp. Form.C24H30N4O3S
Mol. Mass.454.585
SMILESCCC(O)(CC)c1cc(OCCN2CCOCC2)c2cc([nH]c2c1)-c1n[nH]c2ccsc12