Reaction Details
TargetSerine/threonine-protein kinase PknB
LigandBDBM50381107
Substrate/Competitorn/a
Meas. Tech.ChEMBL_814187 (CHEMBL2020901)
IC50 322±n/a nM
Citation Chapman, TMBouloc, NBuxton, RSChugh, JLougheed, KEOsborne, SASaxty, BSmerdon, SJTaylor, DLWhalley, D Substituted aminopyrimidine protein kinase B (PknB) inhibitors show activity against Mycobacterium tuberculosis. Bioorg Med Chem Lett22:3349-53 (2012) 
 
Serine/threonine-protein kinase PknB
Name:Serine/threonine-protein kinase PknB
Type:PROTEIN
Mol. Mass.:66497.93
Organism:Mycobacterium tuberculosis
Description:ChEMBL_774233
Residue:626
BDBM50381107
NameBDBM50381107
Synonyms:CHEMBL2017707
TypeSmall organic molecule
Emp. Form.C19H16N6
Mol. Mass.328.3705
SMILESC1CC1c1cc(Nc2nc(nc3ccccc23)-c2ccncc2)[nH]n1