Reaction Details
TargetSerine/threonine-protein kinase PknB
LigandBDBM50381113
Substrate/Competitorn/a
Meas. Tech.ChEMBL_814187 (CHEMBL2020901)
IC50 428±n/a nM
Citation Chapman, TMBouloc, NBuxton, RSChugh, JLougheed, KEOsborne, SASaxty, BSmerdon, SJTaylor, DLWhalley, D Substituted aminopyrimidine protein kinase B (PknB) inhibitors show activity against Mycobacterium tuberculosis. Bioorg Med Chem Lett22:3349-53 (2012) 
 
Serine/threonine-protein kinase PknB
Name:Serine/threonine-protein kinase PknB
Type:PROTEIN
Mol. Mass.:66497.93
Organism:Mycobacterium tuberculosis
Description:ChEMBL_774233
Residue:626
BDBM50381113
NameBDBM50381113
Synonyms:CHEMBL2017713
TypeSmall organic molecule
Emp. Form.C18H20N6
Mol. Mass.320.3916
SMILESC(Nc1nc(Nc2cc(n[nH]2)C2CC2)c2ccccc2n1)C1CC1