Reaction Details
TargetSerine/threonine-protein kinase PknB
LigandBDBM50381123
Substrate/Competitorn/a
Meas. Tech.ChEMBL_814187 (CHEMBL2020901)
IC50 74±n/a nM
Citation Chapman, TMBouloc, NBuxton, RSChugh, JLougheed, KEOsborne, SASaxty, BSmerdon, SJTaylor, DLWhalley, D Substituted aminopyrimidine protein kinase B (PknB) inhibitors show activity against Mycobacterium tuberculosis. Bioorg Med Chem Lett22:3349-53 (2012) 
 
Serine/threonine-protein kinase PknB
Name:Serine/threonine-protein kinase PknB
Type:PROTEIN
Mol. Mass.:66497.93
Organism:Mycobacterium tuberculosis
Description:ChEMBL_774233
Residue:626
BDBM50381123
NameBDBM50381123
Synonyms:CHEMBL2017724
TypeSmall organic molecule
Emp. Form.C18H19FN6
Mol. Mass.338.3821
SMILESFc1cccc(CCNc2nccc(Nc3cc(n[nH]3)C3CC3)n2)c1