Reaction Details
TargetSerine/threonine-protein kinase PknB
LigandBDBM50381133
Substrate/Competitorn/a
Meas. Tech.ChEMBL_814187 (CHEMBL2020901)
IC50 56±n/a nM
Citation Chapman, TMBouloc, NBuxton, RSChugh, JLougheed, KEOsborne, SASaxty, BSmerdon, SJTaylor, DLWhalley, D Substituted aminopyrimidine protein kinase B (PknB) inhibitors show activity against Mycobacterium tuberculosis. Bioorg Med Chem Lett22:3349-53 (2012) 
 
Serine/threonine-protein kinase PknB
Name:Serine/threonine-protein kinase PknB
Type:PROTEIN
Mol. Mass.:66497.93
Organism:Mycobacterium tuberculosis
Description:ChEMBL_774233
Residue:626
BDBM50381133
NameBDBM50381133
Synonyms:CHEMBL2017734
TypeSmall organic molecule
Emp. Form.C23H26N8
Mol. Mass.414.5061
SMILESCN(C)[C@@H]1CCN(C1)c1cc(Nc2cc(n[nH]2)C2CC2)nc(n1)-c1cccc(c1)C#N