Reaction Details
TargetB1 bradykinin receptor
LigandBDBM50381273
Substrate/Competitorn/a
Meas. Tech.ChEMBL_814368 (CHEMBL2019577)
Ki 8.9±n/a nM
Citation Eles, JBeke, GVágó, IBozó, EHuszár, JTarcsay, AKolok, SSchmidt, EVastag, MHornok, KFarkas, SDomány, GKeseru, GM Quinolinyl- and phenantridinyl-acetamides as bradykinin B1 receptor antagonists. Bioorg Med Chem Lett22:3095-9 (2012) 
 
B1 bradykinin receptor
Name:B1 bradykinin receptor
Type:Enzyme
Mol. Mass.:40508.87
Organism:Homo sapiens (Human)
Description:P46663
Residue:353
BDBM50381273
NameBDBM50381273
Synonyms:CHEMBL2018874
TypeSmall organic molecule
Emp. Form.C34H39Cl2N3O4S
Mol. Mass.656.662
SMILESCOc1cccc2C(CC(=O)N[C@H]3CC[C@H](CCN4CCCC4)CC3)N(c3ccccc3-c12)S(=O)(=O)c1ccc(Cl)c(Cl)c1