Reaction Details
TargetB1 bradykinin receptor
LigandBDBM50381265
Substrate/Competitorn/a
Meas. Tech.ChEMBL_814368 (CHEMBL2019577)
Ki 1.7±n/a nM
Citation Eles, JBeke, GVágó, IBozó, EHuszár, JTarcsay, AKolok, SSchmidt, EVastag, MHornok, KFarkas, SDomány, GKeseru, GM Quinolinyl- and phenantridinyl-acetamides as bradykinin B1 receptor antagonists. Bioorg Med Chem Lett22:3095-9 (2012) 
 
B1 bradykinin receptor
Name:B1 bradykinin receptor
Type:Enzyme
Mol. Mass.:40508.87
Organism:Homo sapiens (Human)
Description:P46663
Residue:353
BDBM50381265
NameBDBM50381265
Synonyms:CHEMBL2018873
TypeSmall organic molecule
Emp. Form.C33H30Cl2N4O4S
Mol. Mass.649.587
SMILESCOc1cccc2C(CC(=O)NCCc3ccc(cc3)C3=NCCN3)N(c3ccccc3-c12)S(=O)(=O)c1ccc(Cl)c(Cl)c1