Reaction Details
TargetB1 bradykinin receptor
LigandBDBM50381267
Substrate/Competitorn/a
Meas. Tech.ChEMBL_814368 (CHEMBL2019577)
Ki 1.2±n/a nM
Citation Eles, JBeke, GVágó, IBozó, EHuszár, JTarcsay, AKolok, SSchmidt, EVastag, MHornok, KFarkas, SDomány, GKeseru, GM Quinolinyl- and phenantridinyl-acetamides as bradykinin B1 receptor antagonists. Bioorg Med Chem Lett22:3095-9 (2012) 
 
B1 bradykinin receptor
Name:B1 bradykinin receptor
Type:Enzyme
Mol. Mass.:40508.87
Organism:Homo sapiens (Human)
Description:P46663
Residue:353
BDBM50381267
NameBDBM50381267
Synonyms:CHEMBL2018871
TypeSmall organic molecule
Emp. Form.C32H27Cl2FN4O3S
Mol. Mass.637.551
SMILESFc1ccc-2c(c1)C(CC(=O)NCCc1ccc(cc1)C1=NCCN1)N(c1ccccc-21)S(=O)(=O)c1ccc(Cl)c(Cl)c1