Reaction Details
TargetB1 bradykinin receptor
LigandBDBM50381269
Substrate/Competitorn/a
Meas. Tech.ChEMBL_814368 (CHEMBL2019577)
Ki 4.7±n/a nM
Citation Eles, JBeke, GVágó, IBozó, EHuszár, JTarcsay, AKolok, SSchmidt, EVastag, MHornok, KFarkas, SDomány, GKeseru, GM Quinolinyl- and phenantridinyl-acetamides as bradykinin B1 receptor antagonists. Bioorg Med Chem Lett22:3095-9 (2012) 
 
B1 bradykinin receptor
Name:B1 bradykinin receptor
Type:Enzyme
Mol. Mass.:40508.87
Organism:Homo sapiens (Human)
Description:P46663
Residue:353
BDBM50381269
NameBDBM50381269
Synonyms:CHEMBL2018869
TypeSmall organic molecule
Emp. Form.C33H32N4O3S
Mol. Mass.564.697
SMILESCc1ccc(cc1)S(=O)(=O)N1C(CC(=O)NCCc2ccc(cc2)C2=NCCN2)c2ccccc2-c2ccccc12