Reaction Details
TargetB1 bradykinin receptor
LigandBDBM50381274
Substrate/Competitorn/a
Meas. Tech.ChEMBL_814368 (CHEMBL2019577)
Ki 1±n/a nM
Citation Eles, JBeke, GVágó, IBozó, EHuszár, JTarcsay, AKolok, SSchmidt, EVastag, MHornok, KFarkas, SDomány, GKeseru, GM Quinolinyl- and phenantridinyl-acetamides as bradykinin B1 receptor antagonists. Bioorg Med Chem Lett22:3095-9 (2012) 
 
B1 bradykinin receptor
Name:B1 bradykinin receptor
Type:Enzyme
Mol. Mass.:40508.87
Organism:Homo sapiens (Human)
Description:P46663
Residue:353
BDBM50381274
NameBDBM50381274
Synonyms:CHEMBL2018866
TypeSmall organic molecule
Emp. Form.C28H34Cl2N4O3S
Mol. Mass.577.566
SMILESClc1ccc(cc1Cl)S(=O)(=O)N1CCc2ccccc2C1CC(=O)N[C@H]1CC[C@H](CCC2=NCCN2)CC1