Reaction Details
TargetB1 bradykinin receptor
LigandBDBM50381277
Substrate/Competitorn/a
Meas. Tech.ChEMBL_814368 (CHEMBL2019577)
Ki 4.3±n/a nM
Citation Eles, JBeke, GVágó, IBozó, EHuszár, JTarcsay, AKolok, SSchmidt, EVastag, MHornok, KFarkas, SDomány, GKeseru, GM Quinolinyl- and phenantridinyl-acetamides as bradykinin B1 receptor antagonists. Bioorg Med Chem Lett22:3095-9 (2012) 
 
B1 bradykinin receptor
Name:B1 bradykinin receptor
Type:Enzyme
Mol. Mass.:40508.87
Organism:Homo sapiens (Human)
Description:P46663
Residue:353
BDBM50381277
NameBDBM50381277
Synonyms:CHEMBL2018863
TypeSmall organic molecule
Emp. Form.C28H34Cl2N4O3S
Mol. Mass.577.566
SMILESClc1ccc(cc1Cl)S(=O)(=O)N1C(CC(=O)N[C@H]2CC[C@H](CCC3=NCCN3)CC2)CCc2ccccc12