Reaction Details
TargetB1 bradykinin receptor
LigandBDBM50381279
Substrate/Competitorn/a
Meas. Tech.ChEMBL_814368 (CHEMBL2019577)
Ki 2.2±n/a nM
Citation Eles, JBeke, GVágó, IBozó, EHuszár, JTarcsay, AKolok, SSchmidt, EVastag, MHornok, KFarkas, SDomány, GKeseru, GM Quinolinyl- and phenantridinyl-acetamides as bradykinin B1 receptor antagonists. Bioorg Med Chem Lett22:3095-9 (2012) 
 
B1 bradykinin receptor
Name:B1 bradykinin receptor
Type:Enzyme
Mol. Mass.:40508.87
Organism:Homo sapiens (Human)
Description:P46663
Residue:353
BDBM50381279
NameBDBM50381279
Synonyms:CHEMBL2018861
TypeSmall organic molecule
Emp. Form.C28H28Cl2N4O3S
Mol. Mass.571.518
SMILESClc1ccc(cc1Cl)S(=O)(=O)N1CCc2ccccc2C1CC(=O)NCCc1ccc(cc1)C1=NCCN1