Reaction Details
TargetB1 bradykinin receptor
LigandBDBM50381273
Substrate/Competitorn/a
Meas. Tech.ChEMBL_814371 (CHEMBL2019580)
IC50 43±n/a nM
Citation Eles, JBeke, GVágó, IBozó, EHuszár, JTarcsay, AKolok, SSchmidt, EVastag, MHornok, KFarkas, SDomány, GKeseru, GM Quinolinyl- and phenantridinyl-acetamides as bradykinin B1 receptor antagonists. Bioorg Med Chem Lett22:3095-9 (2012) 
 
B1 bradykinin receptor
Name:B1 bradykinin receptor
Type:Enzyme Catalytic Domain
Mol. Mass.:38389.97
Organism:RAT
Description:B1 BRADYKININ BDKRB1 RAT::P97583
Residue:337
BDBM50381273
NameBDBM50381273
Synonyms:CHEMBL2018874
TypeSmall organic molecule
Emp. Form.C34H39Cl2N3O4S
Mol. Mass.656.662
SMILESCOc1cccc2C(CC(=O)N[C@H]3CC[C@H](CCN4CCCC4)CC3)N(c3ccccc3-c12)S(=O)(=O)c1ccc(Cl)c(Cl)c1