Reaction Details
TargetCannabinoid receptor 2
LigandBDBM50381880
Substrate/Competitorn/a
Meas. Tech.ChEMBL_817534 (CHEMBL2027757)
Ki 7.8±n/a nM
Citation Manera, CSaccomanni, GMalfitano, AMBertini, SCastelli, FLaezza, CLigresti, ALucchesi, VTuccinardi, TRizzolio, FBifulco, MDi Marzo, VGiordano, AMacchia, MMartinelli, A Rational design, synthesis and anti-proliferative properties of new CB2 selective cannabinoid receptor ligands: an investigation of the 1,8-naphthyridin-2(1H)-one scaffold. Eur J Med Chem52:284-94 (2012) 
 
Cannabinoid receptor 2
Name:Cannabinoid receptor 2
Type:G Protein-Coupled Receptor (GPCR)
Mol. Mass.:39690.94
Organism:Homo sapiens (Human)
Description:P34972
Residue:360
BDBM50381880
NameBDBM50381880
Synonyms:CHEMBL2022698
TypeSmall organic molecule
Emp. Form.C20H23FN2O2
Mol. Mass.342.4072
SMILESFc1ccc(Cn2cccc(C(=O)NC3CCCCCC3)c2=O)cc1