Reaction Details
TargetCannabinoid receptor 1
LigandBDBM50381878
Substrate/Competitorn/a
Meas. Tech.ChEMBL_817533 (CHEMBL2027756)
Ki 1200±n/a nM
Citation Manera, CSaccomanni, GMalfitano, AMBertini, SCastelli, FLaezza, CLigresti, ALucchesi, VTuccinardi, TRizzolio, FBifulco, MDi Marzo, VGiordano, AMacchia, MMartinelli, A Rational design, synthesis and anti-proliferative properties of new CB2 selective cannabinoid receptor ligands: an investigation of the 1,8-naphthyridin-2(1H)-one scaffold. Eur J Med Chem52:284-94 (2012) 
 
Cannabinoid receptor 1
Name:Cannabinoid receptor 1
Type:G Protein-Coupled Receptor (GPCR)
Mol. Mass.:52868.96
Organism:Homo sapiens (Human)
Description:P21554
Residue:472
BDBM50381878
NameBDBM50381878
Synonyms:CHEMBL2022700
TypeSmall organic molecule
Emp. Form.C23H23FN2O2
Mol. Mass.378.4393
SMILESFc1ccc(COc2nc3ccccc3cc2C(=O)NC2CCCCC2)cc1