Reaction Details
TargetCannabinoid receptor 1
LigandBDBM50381879
Substrate/Competitorn/a
Meas. Tech.ChEMBL_817533 (CHEMBL2027756)
Ki 950±n/a nM
Citation Manera, CSaccomanni, GMalfitano, AMBertini, SCastelli, FLaezza, CLigresti, ALucchesi, VTuccinardi, TRizzolio, FBifulco, MDi Marzo, VGiordano, AMacchia, MMartinelli, A Rational design, synthesis and anti-proliferative properties of new CB2 selective cannabinoid receptor ligands: an investigation of the 1,8-naphthyridin-2(1H)-one scaffold. Eur J Med Chem52:284-94 (2012) 
 
Cannabinoid receptor 1
Name:Cannabinoid receptor 1
Type:G Protein-Coupled Receptor (GPCR)
Mol. Mass.:52868.96
Organism:Homo sapiens (Human)
Description:P21554
Residue:472
BDBM50381879
NameBDBM50381879
Synonyms:CHEMBL2022699
TypeSmall organic molecule
Emp. Form.C19H29N3O3
Mol. Mass.347.4519
SMILESO=C(NC1CCCCCC1)c1cccn(CCN2CCOCC2)c1=O