Reaction Details
TargetCannabinoid receptor 1
LigandBDBM50381885
Substrate/Competitorn/a
Meas. Tech.ChEMBL_817533 (CHEMBL2027756)
Ki 206±n/a nM
Citation Manera, CSaccomanni, GMalfitano, AMBertini, SCastelli, FLaezza, CLigresti, ALucchesi, VTuccinardi, TRizzolio, FBifulco, MDi Marzo, VGiordano, AMacchia, MMartinelli, A Rational design, synthesis and anti-proliferative properties of new CB2 selective cannabinoid receptor ligands: an investigation of the 1,8-naphthyridin-2(1H)-one scaffold. Eur J Med Chem52:284-94 (2012) 
 
Cannabinoid receptor 1
Name:Cannabinoid receptor 1
Type:G Protein-Coupled Receptor (GPCR)
Mol. Mass.:52868.96
Organism:Homo sapiens (Human)
Description:P21554
Residue:472
BDBM50381885
NameBDBM50381885
Synonyms:CHEMBL2022364
TypeSmall organic molecule
Emp. Form.C23H31N3O3
Mol. Mass.397.5105
SMILESO=C(NC1CCCCCC1)c1cc2ccccc2n(CCN2CCOCC2)c1=O