Reaction Details
TargetReceptor-type tyrosine-protein kinase FLT3
LigandBDBM50381922
Substrate/Competitorn/a
Meas. Tech.ChEMBL_814803 (CHEMBL2026428)
IC50 40±n/a nM
Citation Plé, PAJung, FAshton, SHennequin, LLaine, RLambert-van der Brempt, CMorgentin, RPasquet, GTaylor, S Discovery of new quinoline ether inhibitors with high affinity and selectivity for PDGFR tyrosine kinases. Bioorg Med Chem Lett22:3050-5 (2012) 
 
Receptor-type tyrosine-protein kinase FLT3
Name:Receptor-type tyrosine-protein kinase FLT3
Type:Enzyme
Mol. Mass.:112888.62
Organism:Homo sapiens (Human)
Description:P36888
Residue:993
BDBM50381922
NameBDBM50381922
Synonyms:CHEMBL2023800
TypeSmall organic molecule
Emp. Form.C23H23N5O4
Mol. Mass.433.4598
SMILESCCn1cc(NC(=O)Cc2ccc(Oc3ccnc4cc(OC)c(OC)cc34)cn2)cn1