Reaction Details
TargetVascular endothelial growth factor receptor 2
LigandBDBM50381926
Substrate/Competitorn/a
Meas. Tech.ChEMBL_817758 (CHEMBL2027406)
IC50 10990±n/a nM
Citation Plé, PAJung, FAshton, SHennequin, LLaine, RLambert-van der Brempt, CMorgentin, RPasquet, GTaylor, S Discovery of new quinoline ether inhibitors with high affinity and selectivity for PDGFR tyrosine kinases. Bioorg Med Chem Lett22:3050-5 (2012) 
 
Vascular endothelial growth factor receptor 2
Name:Vascular endothelial growth factor receptor 2
Type:Receptor Tyrosine Kinase
Mol. Mass.:151510.97
Organism:Homo sapiens (Human)
Description:P35968
Residue:1356
BDBM50381926
NameBDBM50381926
Synonyms:CHEMBL2023489 | CHEMBL2023803
TypeSmall organic molecule
Emp. Form.C24H24N4O4
Mol. Mass.432.4718
SMILESCOc1ccc2c(Oc3ccc(CC(=O)Nc4cn(C)nc4C)c(OC)c3)ccnc2c1